Fixing Linker Command Failed With Exit Code 1 In Unit Tests Solutions Information Guide

  1. About on Fixing Linker Command Failed With Exit Code 1 In Unit Tests Solutions
  2. Key Details
  3. Recent Updates
  4. Full Guide
  5. Future Outlook

About on Fixing Linker Command Failed With Exit Code 1 In Unit Tests Solutions

Details Fixing 'Linker Command Failed with Exit Code 1' in Unit Tests: Solutions Update
Looking for the latest information on Fixing Linker Command Failed With Exit Code 1 In Unit Tests Solutions? We've compiled comprehensive data, records, and insights about Fixing Linker Command Failed With Exit Code 1 In Unit Tests Solutions.

Key Details

Understanding the Linker Command Failed With Exit Code 1 Error in iOS Projects News
Explore the primary sources for Fixing Linker Command Failed With Exit Code 1 In Unit Tests Solutions.

Recent Updates

How to Fix Xcode Build Error: Linker Command Failed with Exit Code 1 Update
Stay updated on Fixing Linker Command Failed With Exit Code 1 In Unit Tests Solutions's newest achievements.

Resolving the linker command failed with exit code 1 Error in C+ +  on MacOS Using VSCode
Resolving the linker command failed with exit code 1 Error in C+ + on MacOS Using VSCode
Linker Command failed with exit code 1 (use -v to see invocation), Xcode 8, Swift 3
Linker Command failed with exit code 1 (use -v to see invocation), Xcode 8, Swift 3
Solving the linker command failed with exit code 1 Error in C+ +  on Mac
Solving the linker command failed with exit code 1 Error in C+ + on Mac
C++ : Xcode linker command failed with exit code 1 c++
C++ : Xcode linker command failed with exit code 1 c++
Linker Command failed with exit code 1 use  v to see invocation, Xcode 8, Swift 3
Linker Command failed with exit code 1 use v to see invocation, Xcode 8, Swift 3
Flutter Xcode clang error linker command failed with exit code 1 use  v to see invocation
Flutter Xcode clang error linker command failed with exit code 1 use v to see invocation
error: linker command failed with exit code 1 (use -v to see invocation) in iOS app after...
error: linker command failed with exit code 1 (use -v to see invocation) in iOS app after...
How To Fix Process Exited With Code 1 Command Prompt Error in Windows
How To Fix Process Exited With Code 1 Command Prompt Error in Windows
Jest: error Command failed with exit code 1
Jest: error Command failed with exit code 1
Resolving Linker Errors with CMake, VCPKG, and GoogleTest
Resolving Linker Errors with CMake, VCPKG, and GoogleTest
How To Fix Collect2 Error LD Returned 1 Exit Status Error When Running C Code - Easy Fix
How To Fix Collect2 Error LD Returned 1 Exit Status Error When Running C Code - Easy Fix

Full Guide

Data is compiled from public records and verified media reports.

Last Updated: September 27, 2026

Future Outlook

Full C++ : Visual Studio Code clang error: linker command failed with exit code 1 on Mac News
For 2026, Fixing Linker Command Failed With Exit Code 1 In Unit Tests Solutions remains one of the most searched-for information profiles. Check back for the latest updates.

Disclaimer: Disclaimer: All information is compiled from publicly available data, media reports, and analysis. Actual details may vary.

Summary

In this video, we tackle a common yet frustrating issue faced by developers: the " Discover why you might be encountering the ' In this video, we'll tackle a common issue faced by many iOS developers: the Xcode build C++ : Visual Studio Code clang error: Welcome to Mixible, your go-to source for comprehensive and informative content covering a broad range of topics from Stack ... As an Amazon Associate I earn from qualifying purchases. clang: error: Discover how to solve linking issues in your CMake project using VCPKG and GoogleTest to ensure seamless

Fixing Linker Command Failed With Exit Code 1 In Unit Tests Solutions.pdf

Size: 1.96 MB · Format: PDF · Secure Download

Download PDF Read Online

Frequently Asked Questions

What is the most accurate information about Fixing Linker Command Failed With Exit Code 1 In Unit Tests Solutions?

Our platform aggregates the most comprehensive and up-to-date insights, ensuring you get relevant details about Fixing Linker Command Failed With Exit Code 1 In Unit Tests Solutions.

Why is Fixing Linker Command Failed With Exit Code 1 In Unit Tests Solutions trending right now?

Interest in Fixing Linker Command Failed With Exit Code 1 In Unit Tests Solutions has surged recently as more people seek reliable resources, related media, and detailed analysis.

Where can I find related media and updates for Fixing Linker Command Failed With Exit Code 1 In Unit Tests Solutions?

You can explore extensive galleries, video summaries, and related content directly on this page.

How often is the content about Fixing Linker Command Failed With Exit Code 1 In Unit Tests Solutions updated?

We regularly update our database with the latest information, media, and analysis related to Fixing Linker Command Failed With Exit Code 1 In Unit Tests Solutions.

Related Documents

Popular Topics

Python For Loops Visually Explained Java Tutorials Java Oops Inheritance Introduction By Durga Sir %f0%9f%94%a5%f0%9f%8e%83 Halloween Fireplace 4k 12 Hours Green Fireplace With Crackling Fire Sounds Hypnotic Fire Python For Beginner 049 Python Map Filter Reduce After Effects Tutorial Simulating Rainfall With Cc Particle World How To Avoid Online Dating Scams Use This Background Check Tool March Madness Explained College Application And Essay Workshop Scheduling Your Zoom Call And Adding A Zoom Room Make A Professional Certificate In Microsoft Word Ms Word Tutorial Step By Step Machine Learning Tutorial 4 Logistic Regression In Machine Learning Commenting Your Code In Javascript Python Numpy Linear Algebra Easy Hand Lettering Tutorial Shorts Lettering Let S Build A Javascript Countdown Timer Using Html Css And Javascript