React Native Run Android Fail Appincrementaldebugjavacompilationsafeguard Failed Information Guide

  1. Overview on React Native Run Android Fail Appincrementaldebugjavacompilationsafeguard Failed
  2. Important Facts
  3. History
  4. Full Guide
  5. Summary

Overview on React Native Run Android Fail Appincrementaldebugjavacompilationsafeguard Failed

React-Native run-android FAIL! appincrementalDebugJavaCompilationSafeguard FAILED Guide
Looking for the latest information on React Native Run Android Fail Appincrementaldebugjavacompilationsafeguard Failed? We've researched comprehensive data, records, and insights about React Native Run Android Fail Appincrementaldebugjavacompilationsafeguard Failed.

Important Facts

Details How to Fix the Failed to Install App Error in React Native on Android Guide
Explore the main sources for React Native Run Android Fail Appincrementaldebugjavacompilationsafeguard Failed.

History

Full Fixing Gradle build failed Error in React Native with EAS Build for Android News
Stay updated on React Native Run Android Fail Appincrementaldebugjavacompilationsafeguard Failed's newest achievements.

[Fixed] Gradle build failed with unknown error in Expo/React Native
[Fixed] Gradle build failed with unknown error in Expo/React Native
React Native Failed to install the App error, Android emulator not starting or lost connection
React Native Failed to install the App error, Android emulator not starting or lost connection
Fixing React Native Android Build Errors by Downgrading the NDK Version
Fixing React Native Android Build Errors by Downgrading the NDK Version
Error Command failed gradlew bat app installDebug  PreactNativeDevServerPort=8081 React Native fixed
Error Command failed gradlew bat app installDebug PreactNativeDevServerPort=8081 React Native fixed
error message : Task :app:installDebug FAILED | React Native Errors | Fixed!
error message : Task :app:installDebug FAILED | React Native Errors | Fixed!
Solved: React Native Build Failed | Reanimated & Gradle Lock Issue Fixed!
Solved: React Native Build Failed | Reanimated & Gradle Lock Issue Fixed!
Fix Gradle Errors in React Native | Step-by-Step Guide
Fix Gradle Errors in React Native | Step-by-Step Guide
Unable to load script - React Native - FIX
Unable to load script - React Native - FIX
How to Fix the No Emulators Found Error When Running React Native on Android in macOS
How to Fix the No Emulators Found Error When Running React Native on Android in macOS
Use Android Mobile as Emulator in React Native CLI | Run React Native App on Real Android Device
Use Android Mobile as Emulator in React Native CLI | Run React Native App on Real Android Device
React Native Run Error - Solution (Arch Linux)
React Native Run Error - Solution (Arch Linux)

Full Guide

Data is compiled from public records and verified media reports.

Last Updated: September 27, 2026

Summary

Full Fixing React Native Error: Command `run-android` Unrecognized After npm Install Update
For 2026, React Native Run Android Fail Appincrementaldebugjavacompilationsafeguard Failed remains one of the most searched-for information profiles. Check back for the latest updates.

Disclaimer: Disclaimer: All information is compiled from publicly available data, media reports, and analysis. Actual details may vary.

Summary

long story short : open command prompt in the Learn how to resolve the Gradle build In this video, we tackle a common issue faced by Provide an excellent and consistent remedy for "task -app-installDebug" In this video, I fixed two common Facing Gradle issues while working with Learn how to troubleshoot the ` In this step-by-step tutorial, you'll learn how to use your What went wrong: - A problem occurred evaluating project ':app'. -

React Native Run Android Fail Appincrementaldebugjavacompilationsafeguard Failed.pdf

Size: 2.27 MB · Format: PDF · Secure Download

Download PDF Read Online

Frequently Asked Questions

What is the most accurate information about React Native Run Android Fail Appincrementaldebugjavacompilationsafeguard Failed?

Our platform aggregates the most comprehensive and up-to-date insights, ensuring you get relevant details about React Native Run Android Fail Appincrementaldebugjavacompilationsafeguard Failed.

Why is React Native Run Android Fail Appincrementaldebugjavacompilationsafeguard Failed trending right now?

Interest in React Native Run Android Fail Appincrementaldebugjavacompilationsafeguard Failed has surged recently as more people seek reliable resources, related media, and detailed analysis.

Where can I find related media and updates for React Native Run Android Fail Appincrementaldebugjavacompilationsafeguard Failed?

You can explore extensive galleries, video summaries, and related content directly on this page.

How often is the content about React Native Run Android Fail Appincrementaldebugjavacompilationsafeguard Failed updated?

We regularly update our database with the latest information, media, and analysis related to React Native Run Android Fail Appincrementaldebugjavacompilationsafeguard Failed.

Related Documents

Popular Topics

Learn The Insider Tricks Of The Trade With Periodic Table Charge Mastery Easy AARP Crosswords For Cognitive Therapy And Relaxation The Ins And Outs Of Drafting Your Own Prenuptial Agreement ASU Student Perks You Won't Find On The Calendar Insider Secrets To Navigating FISD's 25 26 Calendar Are Birth Date Matches Accurate In Finding True Love Partners Stay On The Road NJ Registration Renewal Guide For Beginners Get Ready For Fall 2025 At GMU Denver Public Library Events And Programs You Won't Want To Miss Create Stunning Gorilla Tag PFPs In Minutes With This Simple Hack Top GCS Calendar Time Management Mistakes You're Making Daily Streamline Your Exports With FedEx Pro Forma Invoice Best Practices Your Guide To Creating Meaningful 29th May Memories Get Ready For A Shocking Good Time With Pikachu Bead Templates Elevate Your Brand With Unique Colors From Random Generators