Task React Native Admob Compiledebugjavawithjavac Failed Solved Information Guide

  1. Overview to Task React Native Admob Compiledebugjavawithjavac Failed Solved
  2. Core Information
  3. History
  4. Full Guide
  5. Future Outlook

Overview to Task React Native Admob Compiledebugjavawithjavac Failed Solved

Full Task :react-native-admob:compileDebugJavaWithJavac FAILED (SOLVED) Guide
Looking for the latest information on Task React Native Admob Compiledebugjavawithjavac Failed Solved? We've gathered comprehensive data, records, and insights about Task React Native Admob Compiledebugjavawithjavac Failed Solved.

Core Information

Details Task :react-native-reanimated: compileDebugJavaWithJavac FAILED by MD Israr News
Explore the main sources for Task React Native Admob Compiledebugjavawithjavac Failed Solved.

History

Details Task app:compileDebugJavaWithJavac failed Guide
Stay updated on Task React Native Admob Compiledebugjavawithjavac Failed Solved's latest milestones.

Android : Execution failed for task ':app:compileDebugJavaWithJavac':
Android : Execution failed for task ':app:compileDebugJavaWithJavac':
How to Fix: Execution failed for task ':app:compileDebugJavaWithJavac'
How to Fix: Execution failed for task ':app:compileDebugJavaWithJavac'
Fixing the Execution Failed for Task Error in React Native
Fixing the Execution Failed for Task Error in React Native
Task :app:processDebugMainManifest FAILED | React Native Push Notification Error
Task :app:processDebugMainManifest FAILED | React Native Push Notification Error
Error on Task apptransformDexArchiveWithExternalLibsDexMergerForDebug FAILED in react-native-maps
Error on Task apptransformDexArchiveWithExternalLibsDexMergerForDebug FAILED in react-native-maps
Task :app:transformNativeLibsWithMergeJniLibsForDebug FAILED in react native | android studio
Task :app:transformNativeLibsWithMergeJniLibsForDebug FAILED in react native | android studio
Android : React-Native assembleRelease fails for task ':app:bundleReleaseJsAndAssets'
Android : React-Native assembleRelease fails for task ':app:bundleReleaseJsAndAssets'
Test Ad show But Real Ad Not Showing | React Native ,Android how to Fixed admob ads problem 2023
Test Ad show But Real Ad Not Showing | React Native ,Android how to Fixed admob ads problem 2023
Failed to initialize react-native-reanimated library... FIX
Failed to initialize react-native-reanimated library... FIX
Admob Policy - Modified ad code Fixes || Admob Violation || React Native App Fixes
Admob Policy - Modified ad code Fixes || Admob Violation || React Native App Fixes
Fixing Gradle build failed Error in React Native with EAS Build for Android
Fixing Gradle build failed Error in React Native with EAS Build for Android

Full Guide

Data is compiled from public records and verified media reports.

Last Updated: September 28, 2026

Future Outlook

Full Android : How to fix Execution failed for task ':app:processDebugManifest' in React Native Guide
For 2026, Task React Native Admob Compiledebugjavawithjavac Failed Solved remains one of the most searched-for information profiles. Check back for the latest updates.

Disclaimer: Disclaimer: All information is compiled from publicly available data, media reports, and analysis. Actual details may vary.

Summary

Having trouble with the Could not create Just Add this as I guide in video android:exported="true" Hashtags: # I have explained to resolve the issue for " Test Ad show But Real Ad Not Showing | This video will show some Fixes on Learn how to resolve the Gradle build

Task React Native Admob Compiledebugjavawithjavac Failed Solved.pdf

Size: 0.89 MB · Format: PDF · Secure Download

Download PDF Read Online

Frequently Asked Questions

What is the most accurate information about Task React Native Admob Compiledebugjavawithjavac Failed Solved?

Our platform aggregates the most comprehensive and up-to-date insights, ensuring you get relevant details about Task React Native Admob Compiledebugjavawithjavac Failed Solved.

Why is Task React Native Admob Compiledebugjavawithjavac Failed Solved trending right now?

Interest in Task React Native Admob Compiledebugjavawithjavac Failed Solved has surged recently as more people seek reliable resources, related media, and detailed analysis.

Where can I find related media and updates for Task React Native Admob Compiledebugjavawithjavac Failed Solved?

You can explore extensive galleries, video summaries, and related content directly on this page.

How often is the content about Task React Native Admob Compiledebugjavawithjavac Failed Solved updated?

We regularly update our database with the latest information, media, and analysis related to Task React Native Admob Compiledebugjavawithjavac Failed Solved.

Related Documents

Popular Topics

Are You Making These Common Mistakes In August To September Planning Unleashing Identity With A Fifth Estate Tattoo For Empowerment The Power Of Word Unscrambles In Spanish Language Learning Cracking The Code On Marine Corps Boot Camp 96 Schedule Unscramble Spanish Phrases In Minutes With Expert Solutions Mastering NFL Pick Em Sheets For Beginners Discover Hidden Secrets To Colouring Squared Like A Pro Colorado State Refund Eligibility: Who Qualifies For The Maximum Creating A Positive Family Environment With Roles Worksheet The Ultimate Guide To Crafting Unique Prayer Card Templates Unlock The Secrets Of A Udayton Academic Calendar AARP Crossword Online Community Offers Support And Fun Mastering The Frisco ISD 2024 25 School Calendar - A Beginner's Roadmap UGA Calendar Of Events Makes Campus Life Easy Get Instant Insight Into Your Life's Purpose With Cafe Astrology