Transformexception Failed To Transform React Native 0 71 0 Rc 0 Debug Aar Com Facebook React Native Information Guide

  1. About of Transformexception Failed To Transform React Native 0 71 0 Rc 0 Debug Aar Com Facebook React Native
  2. Main Features
  3. History
  4. Detailed Analysis
  5. Summary

About of Transformexception Failed To Transform React Native 0 71 0 Rc 0 Debug Aar Com Facebook React Native

Details TransformException Failed to transform react native 0 71 0 rc 0 debug aar com facebook react native Update
Looking for the latest information on Transformexception Failed To Transform React Native 0 71 0 Rc 0 Debug Aar Com Facebook React Native? We've gathered comprehensive data, records, and insights about Transformexception Failed To Transform React Native 0 71 0 Rc 0 Debug Aar Com Facebook React Native.

Main Features

Fix React Native Error: Failed to apply plugin ‘com.facebook.react.rootproject’ || Series 2026 News
Explore the main sources for Transformexception Failed To Transform React Native 0 71 0 Rc 0 Debug Aar Com Facebook React Native.

History

Information No matching variant of com.facebook.react:react-native:0.71.0-rc.0 was found React Native fixed News
Stay updated on Transformexception Failed To Transform React Native 0 71 0 Rc 0 Debug Aar Com Facebook React Native's latest milestones.

Error on Task apptransformDexArchiveWithExternalLibsDexMergerForDebug FAILED in react-native-maps
Error on Task apptransformDexArchiveWithExternalLibsDexMergerForDebug FAILED in react-native-maps
Task :react-native-reanimated: compileDebugJavaWithJavac FAILED by MD Israr
Task :react-native-reanimated: compileDebugJavaWithJavac FAILED by MD Israr
Error Resolving Plugin - id: 'com.facebook.react.settings | React Native CLI Gradle Build Failed
Error Resolving Plugin - id: 'com.facebook.react.settings | React Native CLI Gradle Build Failed
Task :app:transformNativeLibsWithMergeJniLibsForDebug FAILED in react native | android studio
Task :app:transformNativeLibsWithMergeJniLibsForDebug FAILED in react native | android studio
Android : How to include 3rd party aar into Android React Native module
Android : How to include 3rd party aar into Android React Native module
NodeJS : node.js Failed to construct transformer: Error: error:0308010C:digital envelope routines::u
NodeJS : node.js Failed to construct transformer: Error: error:0308010C:digital envelope routines::u
Solved: React Native Build Failed | Reanimated & Gradle Lock Issue Fixed!
Solved: React Native Build Failed | Reanimated & Gradle Lock Issue Fixed!
Fix Gradle Errors in React Native | Step-by-Step Guide
Fix Gradle Errors in React Native | Step-by-Step Guide
Fix Error Resolving Plugin [id: com.facebook.react.settings] in React Native CLI | Step-by-Step
Fix Error Resolving Plugin [id: com.facebook.react.settings] in React Native CLI | Step-by-Step
Null extracted folder for artifact Resolved ArtifactcomponentIdentifier react native build error
Null extracted folder for artifact Resolved ArtifactcomponentIdentifier react native build error
How to Fix react-native-reanimated Build Failures in React Native Projects
How to Fix react-native-reanimated Build Failures in React Native Projects

Detailed Analysis

Data is compiled from public records and verified media reports.

Last Updated: September 27, 2026

Summary

Details NodeJS : React native : Failed to construct transformer: Error: Cannot create a string longer than 0 News
For 2026, Transformexception Failed To Transform React Native 0 71 0 Rc 0 Debug Aar Com Facebook React Native remains one of the most talked-about information profiles. Check back for the latest updates.

Disclaimer: Disclaimer: All information is compiled from publicly available data, media reports, and analysis. Actual details may vary.

Summary

In this video,I explain How do i solve below Hello everyone Welcome back to the channel. In this video, we are going to fix one of the most common Problem: ------- No matching variant of com. I have explained to resolve the issue for "Task :app:transformNativeLibsWithMergeJniLibsForDebug Android : How to include 3rd party In this video, I fixed two common Facing Gradle issues while working with

Transformexception Failed To Transform React Native 0 71 0 Rc 0 Debug Aar Com Facebook React Native.pdf

Size: 1.19 MB · Format: PDF · Secure Download

Download PDF Read Online

Frequently Asked Questions

What is the most accurate information about Transformexception Failed To Transform React Native 0 71 0 Rc 0 Debug Aar Com Facebook React Native?

Our platform aggregates the most comprehensive and up-to-date insights, ensuring you get relevant details about Transformexception Failed To Transform React Native 0 71 0 Rc 0 Debug Aar Com Facebook React Native.

Why is Transformexception Failed To Transform React Native 0 71 0 Rc 0 Debug Aar Com Facebook React Native trending right now?

Interest in Transformexception Failed To Transform React Native 0 71 0 Rc 0 Debug Aar Com Facebook React Native has surged recently as more people seek reliable resources, related media, and detailed analysis.

Where can I find related media and updates for Transformexception Failed To Transform React Native 0 71 0 Rc 0 Debug Aar Com Facebook React Native?

You can explore extensive galleries, video summaries, and related content directly on this page.

How often is the content about Transformexception Failed To Transform React Native 0 71 0 Rc 0 Debug Aar Com Facebook React Native updated?

We regularly update our database with the latest information, media, and analysis related to Transformexception Failed To Transform React Native 0 71 0 Rc 0 Debug Aar Com Facebook React Native.

Related Documents

Popular Topics

Python Tutorial 2 Global Vs Local Variables Automation Testing In 10 Mins In Javascript Selenium Using Protractor Test The Top 5 Free Beginner Friendly Baby Quilt Patterns Color Flipper Javascript Javascript Project For Beginners Fridge Chalkboard Spring Commencement 2015 Advantages With Css Data Visualization And D3 Js Cedar Point Prepares For Season With Hiring Event How To Handle Node Js Errors Like A Pro Java Tutorial For Beginners Write Code On Notepad Compile And Run On Cmd Java First Program Python Logical Operators And If Statements Practice Problems Box Plot Explained Clearly In Tamil Swiftui Essentials Ios Development Basics Codelab Part 8 Mastering Color Codes Why Hexadecimal To Color Matters For Designers Standard Ruby Style Guide Rubyconf 2018