Ubuntu While Creating Module Getting Error 2 Solutions Information Guide

  1. Overview on Ubuntu While Creating Module Getting Error 2 Solutions
  2. Key Details
  3. History
  4. Full Guide
  5. Final Thoughts

Overview on Ubuntu While Creating Module Getting Error 2 Solutions

Information Ubuntu: while creating module getting error (2 Solutions!!) News
Looking for the latest information on Ubuntu While Creating Module Getting Error 2 Solutions? We've researched comprehensive data, records, and insights about Ubuntu While Creating Module Getting Error 2 Solutions.

Key Details

Information Ubuntu: Getting Error 2 when doing make dep Guide
Explore the key sources for Ubuntu While Creating Module Getting Error 2 Solutions.

History

Information Ubuntu: make: \*\*\* [modules] Error 2 Update
Stay updated on Ubuntu While Creating Module Getting Error 2 Solutions's newest achievements.

Ubuntu: make: \*\*\* [all] Error 2 Install gr ieee802-11
Ubuntu: make: \*\*\* [all] Error 2 Install gr ieee802-11
Ubuntu: I think /lib/modules/$(uname -r)/build points to incorrect folder (2 Solutions!!)
Ubuntu: I think /lib/modules/$(uname -r)/build points to incorrect folder (2 Solutions!!)
Ubuntu: ImportError: No module named builtins (2 Solutions!!)
Ubuntu: ImportError: No module named builtins (2 Solutions!!)
Ubuntu: How do I fix a error on a failed module build for Virtualbox (2 Solutions!!)
Ubuntu: How do I fix a error on a failed module build for Virtualbox (2 Solutions!!)
Make does not compile modules. Error: Building modules, stage 2. MODPOST 0 modules (2 Solutions!!)
Make does not compile modules. Error: Building modules, stage 2. MODPOST 0 modules (2 Solutions!!)
Ubuntu: How to resolve error when installing Perl CPAN modules
Ubuntu: How to resolve error when installing Perl CPAN modules
UBUNTU FIX: Error: Cannot find module 'semver'
UBUNTU FIX: Error: Cannot find module 'semver'
Ubuntu: configure: error: C compiler cannot create executables (2 Solutions!!)
Ubuntu: configure: error: C compiler cannot create executables (2 Solutions!!)
Python Import Error ModuleNotFoundError : No Module Named GObject In Ubuntu Linux
Python Import Error ModuleNotFoundError : No Module Named GObject In Ubuntu Linux
Ubuntu: Nvidia Driver Install Error - Kernel module failed to build. (2 Solutions!!)
Ubuntu: Nvidia Driver Install Error - Kernel module failed to build. (2 Solutions!!)
UBUNTU FIX: configure: error: C++ compiler cannot create executables
UBUNTU FIX: configure: error: C++ compiler cannot create executables

Full Guide

Data is compiled from public records and verified media reports.

Last Updated: September 29, 2026

Final Thoughts

Full Unix & Linux: make: \*\*\* [all] Error 2 Guide
For 2026, Ubuntu While Creating Module Getting Error 2 Solutions remains one of the most talked-about information profiles. Check back for the latest updates.

Disclaimer: Disclaimer: All information is compiled from publicly available data, media reports, and analysis. Actual details may vary.

Summary

amzn.to/4aLHbLD You're literally one away from a better setup — grab it now! As an Amazon Associate I earn ... STUCK? Telegram us t.me/unixandlinux A

Ubuntu While Creating Module Getting Error 2 Solutions.pdf

Size: 1.54 MB · Format: PDF · Secure Download

Download PDF Read Online

Frequently Asked Questions

What is the most accurate information about Ubuntu While Creating Module Getting Error 2 Solutions?

Our platform aggregates the most comprehensive and up-to-date insights, ensuring you get relevant details about Ubuntu While Creating Module Getting Error 2 Solutions.

Why is Ubuntu While Creating Module Getting Error 2 Solutions trending right now?

Interest in Ubuntu While Creating Module Getting Error 2 Solutions has surged recently as more people seek reliable resources, related media, and detailed analysis.

Where can I find related media and updates for Ubuntu While Creating Module Getting Error 2 Solutions?

You can explore extensive galleries, video summaries, and related content directly on this page.

How often is the content about Ubuntu While Creating Module Getting Error 2 Solutions updated?

We regularly update our database with the latest information, media, and analysis related to Ubuntu While Creating Module Getting Error 2 Solutions.

Related Documents

Popular Topics

Robert Romero Web Png 1x Getting Input From User Gui Python Tkinter How To Create Labels And Entries In Tkinter The Surprising Math Minute Habits Of The Worlds Top Problem Solvers Zeta Potential Data Processing Common Misconceptions About Journal Advocate Sterling Co Vfr Flight Planning The Navigation Log Part 1 Wipe Your Bottom Watch The 1 Potty Training Program Temporary Files And Directories In Python 12 Multi Step Unit Conversions Python Tutorial 13 Data Structures Lists Tuples Dictionaries Sets Junit Tutorial Junit Annotations Basics Naive String Matching Algorithm Design And Analysis Of Algorithm Time Complexity Example The Surprising Truth About Vol Message Board Community Dynamics Disney On Ice Biloxi 2024blog Posts From Senior Java Dev To Rust Session 2 1 1 Rust Coaching