Execution Failed For Task App Checkdebugduplicateclasses Information Guide

  1. Overview of Execution Failed For Task App Checkdebugduplicateclasses
  2. Key Details
  3. History
  4. Full Guide
  5. Conclusion

Overview of Execution Failed For Task App Checkdebugduplicateclasses

Details How to Resolve the Flutter Execution failed for task ':app:checkDebugDuplicateClasses' Error Update
Looking for the latest information on Execution Failed For Task App Checkdebugduplicateclasses? We've researched comprehensive data, records, and insights about Execution Failed For Task App Checkdebugduplicateclasses.

Key Details

Full Execution failed for task ':app:checkDebugDuplicateClasses' (Android Studio) 2023 Guide
Explore the primary sources for Execution Failed For Task App Checkdebugduplicateclasses.

History

Information Error : Execution failed for task':app:checkDebugDuplicateClasses'.. News
Stay updated on Execution Failed For Task App Checkdebugduplicateclasses's latest milestones.

How to fix Execution failed for task ':app:compileDebugKotlin' | jvm target compatibility error.
How to fix Execution failed for task ':app:compileDebugKotlin' | jvm target compatibility error.
Fix for 'Execution failed for task :app:mapDebugSourceSetPaths' Error in Flutter & Firebase
Fix for 'Execution failed for task :app:mapDebugSourceSetPaths' Error in Flutter & Firebase
Execution failed for task ':app:compileDebugKotlin' in Android Studio || Flutter || ERROR SOLVED ✅
Execution failed for task ':app:compileDebugKotlin' in Android Studio || Flutter || ERROR SOLVED ✅
learn flutter, What went wrong: Execution failed for task ':app:checkDebugDuplicateClasses'.
learn flutter, What went wrong: Execution failed for task ':app:checkDebugDuplicateClasses'.
Execution failed for task ':app:checkDebugDuplicateClasses'
Execution failed for task ':app:checkDebugDuplicateClasses'
Android : Execution failed for task ':app:checkDebugDuplicateClasses'. Ionic4 Android
Android : Execution failed for task ':app:checkDebugDuplicateClasses'. Ionic4 Android
FAILURE: Build failed with an exception | Execution failed for task ':app:processDebugManifest' |
FAILURE: Build failed with an exception | Execution failed for task ':app:processDebugManifest' |
Execution failed for task 'appcheckDebugDuplicateClasses' | Flutter error 100% Solve
Execution failed for task 'appcheckDebugDuplicateClasses' | Flutter error 100% Solve
Execution failed for task ':app:checkDebugAarMetadata'. | Android Studio Error Fixed | Error Resolve
Execution failed for task ':app:checkDebugAarMetadata'. | Android Studio Error Fixed | Error Resolve
Android : Error:Execution failed for task ':app:kaptDebugKotlin'
Android : Error:Execution failed for task ':app:kaptDebugKotlin'
How to fix Execution failed for task ':app:processDebugGoogleServices'. in Android Studio 2021
How to fix Execution failed for task ':app:processDebugGoogleServices'. in Android Studio 2021

Full Guide

Data is compiled from public records and verified media reports.

Last Updated: September 27, 2026

Conclusion

Information Fix Execution failed for task  app check Debug Duplicate Classes || Android Studio 2022 | Ict Foysal News
For 2026, Execution Failed For Task App Checkdebugduplicateclasses remains one of the most talked-about information profiles. Check back for the latest updates.

Disclaimer: Disclaimer: All information is compiled from publicly available data, media reports, and analysis. Actual details may vary.

Summary

Learn how to fix the common `Flutter In this tutorial, we'll tackle the common Android Studio build configurations{ all*.exclude group:'com.google.guava', module: 'listenablefuture' } Solution for Kotlin project compilation error " If This Video Helped You, Please My Channel Thank You For Watching. learn flutter and android. FAILURE: Build failed with an exception. * What went wrong: الله يسعدكم وصلوا على النبي واشتراك في القناة FAILURE: Build failed with an exception. * What went wrong: Download the code file and paste it into your project as explained in the video Code Link: ... Android studio common error when we run new Android project on Updated version so here is Error: Execution failed for task ...

Execution Failed For Task App Checkdebugduplicateclasses.pdf

Size: 2.97 MB · Format: PDF · Secure Download

Download PDF Read Online

Frequently Asked Questions

What is the most accurate information about Execution Failed For Task App Checkdebugduplicateclasses?

Our platform aggregates the most comprehensive and up-to-date insights, ensuring you get relevant details about Execution Failed For Task App Checkdebugduplicateclasses.

Why is Execution Failed For Task App Checkdebugduplicateclasses trending right now?

Interest in Execution Failed For Task App Checkdebugduplicateclasses has surged recently as more people seek reliable resources, related media, and detailed analysis.

Where can I find related media and updates for Execution Failed For Task App Checkdebugduplicateclasses?

You can explore extensive galleries, video summaries, and related content directly on this page.

How often is the content about Execution Failed For Task App Checkdebugduplicateclasses updated?

We regularly update our database with the latest information, media, and analysis related to Execution Failed For Task App Checkdebugduplicateclasses.

Related Documents

Popular Topics

Essential Wilderness Navigation 9 Dv Techniques Data Visualization Pitfalls And How To Avoid Them Tmt4113 How To Fix Npm Error Code Einvalidtagname Troubleshooting Guide Npm Error Code Einvalidtagname Concatenating Strings In Python Python Nesoacademy Quickconcepts C Tutorial Send Sms Message Foxlearn Submit Sitemap In Wordpress Without Installing Any Plugin 2023 Remove All Adjacent Duplicates In String Leetcode 1047 Javascript Getting Started Faster With Git And Github Coding Is Changing Fast Ai Agents Explained How To Read Synastry Chart On Astro Com Karmic Relationships Matlab Octave Basic Signal Plot Unit Samples Javascript Tutorial For Beginners 32 What Is The Dom In Javascript 13 Python Operators Explained Beginner Friendly Guide Fixing The Command Phasescriptexecution Error In React Native With Xcode 12 5 Explore The Wonders Of The Northeastern United States On An Incredibly Detailed Blank Map