Error 215 Assertion Failed Src Type Cv 8uc1 In Function Cv Adaptivethreshold Information Guide

  1. Background of Error 215 Assertion Failed Src Type Cv 8uc1 In Function Cv Adaptivethreshold
  2. Key Details
  3. Recent Updates
  4. Full Guide
  5. Future Outlook

Background of Error 215 Assertion Failed Src Type Cv 8uc1 In Function Cv Adaptivethreshold

Details error: (-215:Assertion failed) src.type() == CV_8UC1 in function 'cv::adaptiveThreshold' News
Looking for the latest information on Error 215 Assertion Failed Src Type Cv 8uc1 In Function Cv Adaptivethreshold? We've compiled comprehensive data, records, and insights about Error 215 Assertion Failed Src Type Cv 8uc1 In Function Cv Adaptivethreshold.

Key Details

error: (-215:Assertion failed) !_src.empty() in function 'cv::cvtColor' SOLVED in opencv News
Explore the primary sources for Error 215 Assertion Failed Src Type Cv 8uc1 In Function Cv Adaptivethreshold.

Recent Updates

(Solution)cv2.error: error: (-215:Assertion failed) !_src.empty() in function 'cv::cvtColor' News
Stay updated on Error 215 Assertion Failed Src Type Cv 8uc1 In Function Cv Adaptivethreshold's newest achievements.

(SOLVED) Error Assertion failed ! src empty in Function  cv: cvtColor | Python error | cv2 Module
(SOLVED) Error Assertion failed ! src empty in Function cv: cvtColor | Python error | cv2 Module
100% resolved imshow | (-215: Assertion Failed) size.width && size.height in function 'cv::imshow'
100% resolved imshow | (-215: Assertion Failed) size.width && size.height in function 'cv::imshow'
cv2.error: error: (-215:Assertion failed) !_src.empty() in function 'cv::cvtColor'
cv2.error: error: (-215:Assertion failed) !_src.empty() in function 'cv::cvtColor'
error: (-215:Assertion failed) !ssize.empty() in function 'cv::resize' | cv2.error
error: (-215:Assertion failed) !ssize.empty() in function 'cv::resize' | cv2.error
error:(-215:Assertion failed) size.width0 && size.height0 in function 'cv::imshow' SOLVED in opencv
error:(-215:Assertion failed) size.width0 && size.height0 in function 'cv::imshow' SOLVED in opencv
cv2.error: OpenCV(4.5.5) error: (-215:Assertion failed) !_img.empty() in function 'cv::imwrite'
cv2.error: OpenCV(4.5.5) error: (-215:Assertion failed) !_img.empty() in function 'cv::imwrite'
error: (-215:Assertion failed) size.width>0 && size.height>0 in function 'cv::imshow' |cv2.error
error: (-215:Assertion failed) size.width>0 && size.height>0 in function 'cv::imshow' |cv2.error
error: (-215:Assertion failed) size.width>0 && size.height>0 in function 'cv::imshow' |cv2.error
error: (-215:Assertion failed) size.width>0 && size.height>0 in function 'cv::imshow' |cv2.error
Video Capture function produces cv::cvtcolor error | OpenCv error resolved
Video Capture function produces cv::cvtcolor error | OpenCv error resolved
PYTHON : open cv error: (-215) scn == 3 || scn == 4 in function cvtColor
PYTHON : open cv error: (-215) scn == 3 || scn == 4 in function cvtColor
cv2.error: OpenCV(4.5.5) :-1: error: (-5:Bad argument) in function 'drawMatches' || cv.drawMatches
cv2.error: OpenCV(4.5.5) :-1: error: (-5:Bad argument) in function 'drawMatches' || cv.drawMatches

Full Guide

Data is compiled from public records and verified media reports.

Last Updated: September 27, 2026

Future Outlook

Information error: (-215:Assertion failed) !empty() in function 'cv::CascadeClassifier::detectMultiScale Update
For 2026, Error 215 Assertion Failed Src Type Cv 8uc1 In Function Cv Adaptivethreshold remains one of the most talked-about information profiles. Check back for the latest updates.

Disclaimer: Disclaimer: All information is compiled from publicly available data, media reports, and analysis. Actual details may vary.

Summary

error215AssertionfailedsrctypeCV_8UC1infunctioncvadaptiveThreshold # I am fresher youtuber Sorry for my mistakes. If you have any query here, I will reply you. Thank you. cv2errorOpenCV4521error5BadargumentinfunctiondrawMatches #

Error 215 Assertion Failed Src Type Cv 8uc1 In Function Cv Adaptivethreshold.pdf

Size: 2.39 MB · Format: PDF · Secure Download

Download PDF Read Online

Frequently Asked Questions

What is the most accurate information about Error 215 Assertion Failed Src Type Cv 8uc1 In Function Cv Adaptivethreshold?

Our platform aggregates the most comprehensive and up-to-date insights, ensuring you get relevant details about Error 215 Assertion Failed Src Type Cv 8uc1 In Function Cv Adaptivethreshold.

Why is Error 215 Assertion Failed Src Type Cv 8uc1 In Function Cv Adaptivethreshold trending right now?

Interest in Error 215 Assertion Failed Src Type Cv 8uc1 In Function Cv Adaptivethreshold has surged recently as more people seek reliable resources, related media, and detailed analysis.

Where can I find related media and updates for Error 215 Assertion Failed Src Type Cv 8uc1 In Function Cv Adaptivethreshold?

You can explore extensive galleries, video summaries, and related content directly on this page.

How often is the content about Error 215 Assertion Failed Src Type Cv 8uc1 In Function Cv Adaptivethreshold updated?

We regularly update our database with the latest information, media, and analysis related to Error 215 Assertion Failed Src Type Cv 8uc1 In Function Cv Adaptivethreshold.

Related Documents

Popular Topics

Tangram Animal Puzzles For Kids Mastering Python Decorators With Examples Part 1 Deploy Folder Redirection In Windows Server 2022 How To Put Ez Pass Sticker On Car Correctly Place Ez Pass For Smooth Toll Reads 2025 L Doublez Button Hover Effect In Html And Css Coding Programming Html Css Code For America Code For All Beta Python Modules And Packages Python 3 6 Validate Scope Process Avoid Common Tableau Mistakes Best Practices For Creating Effective Pie Charts Html Seo Html Css Html Seo Basics Html Css Tutorial Html Tutorial For Beginners Html Tutorial Seo Query Optimization Part 2 Instagram S New Algorithm Here S What S Changed For 2026 Color Changing Toggle Switch Css Html Tutorial Linux Tutorial 42 Sorting Files Using Ls Command How I Got Good At Coding Interviews