Cv2 Error Error 215 Assertion Failed Src Empty In Function Cv Cvtcolor Information Guide

  1. Introduction on Cv2 Error Error 215 Assertion Failed Src Empty In Function Cv Cvtcolor
  2. Core Information
  3. Recent Updates
  4. Detailed Analysis
  5. Summary

Introduction on Cv2 Error Error 215 Assertion Failed Src Empty In Function Cv Cvtcolor

(Solution)cv2.error: error: (-215:Assertion failed) !_src.empty() in function 'cv::cvtColor' Guide
Looking for the latest information on Cv2 Error Error 215 Assertion Failed Src Empty In Function Cv Cvtcolor? We've compiled comprehensive data, records, and insights about Cv2 Error Error 215 Assertion Failed Src Empty In Function Cv Cvtcolor.

Core Information

error: (-215:Assertion failed) !_src.empty() in function 'cv::cvtColor' SOLVED in opencv Guide
Explore the primary sources for Cv2 Error Error 215 Assertion Failed Src Empty In Function Cv Cvtcolor.

Recent Updates

Full cv2.error: error: (-215:Assertion failed) !_src.empty() in function 'cv::cvtColor' News
Stay updated on Cv2 Error Error 215 Assertion Failed Src Empty In Function Cv Cvtcolor's newest achievements.

(SOLVED) Error Assertion failed ! src empty in Function  cv: cvtColor | Python error | cv2 Module
(SOLVED) Error Assertion failed ! src empty in Function cv: cvtColor | Python error | cv2 Module
PYTHON : error: (-215) !empty() in function detectMultiScale
PYTHON : error: (-215) !empty() in function detectMultiScale
PYTHON : imread returns None, violating assertion !_src.empty() in function 'cvtColor' error
PYTHON : imread returns None, violating assertion !_src.empty() in function 'cvtColor' error
PYTHON : imread returns None, violating assertion !_src.empty() in function 'cvtColor' error
PYTHON : imread returns None, violating assertion !_src.empty() in function 'cvtColor' error
error: (-215:Assertion failed) !ssize.empty() in function 'cv::resize' | cv2.error
error: (-215:Assertion failed) !ssize.empty() in function 'cv::resize' | cv2.error
cv2.error: OpenCV(4.5.5) error: (-215:Assertion failed) !_img.empty() in function 'cv::imwrite'
cv2.error: OpenCV(4.5.5) error: (-215:Assertion failed) !_img.empty() in function 'cv::imwrite'
cv2.error: OpenCV(4.5.2) :-1: error: (-5:Bad argument) in function 'cvtColor'
cv2.error: OpenCV(4.5.2) :-1: error: (-5:Bad argument) in function 'cvtColor'
error: (-215:Assertion failed) !empty() in function 'cv::CascadeClassifier::detectMultiScale
error: (-215:Assertion failed) !empty() in function 'cv::CascadeClassifier::detectMultiScale
PYTHON : error: (-215) !empty() in function detectMultiScale
PYTHON : error: (-215) !empty() in function detectMultiScale
C++ : OpenCV Error: Assertion failed (scn == 3 || scn == 4) in cv:: cvtColor, file ..\..\..\..\openc
C++ : OpenCV Error: Assertion failed (scn == 3 || scn == 4) in cv:: cvtColor, file ..\..\..\..\openc
error: (-215:Assertion failed) src.type() == CV_8UC1 in function 'cv::adaptiveThreshold'
error: (-215:Assertion failed) src.type() == CV_8UC1 in function 'cv::adaptiveThreshold'

Detailed Analysis

Data is compiled from public records and verified media reports.

Last Updated: September 28, 2026

Summary

Details Video Capture function produces cv::cvtcolor error | OpenCv error resolved Guide
For 2026, Cv2 Error Error 215 Assertion Failed Src Empty In Function Cv Cvtcolor remains one of the most talked-about information profiles. Check back for the newest reports.

Disclaimer: Disclaimer: All information is compiled from publicly available data, media reports, and analysis. Actual details may vary.

Summary

I am fresher youtuber Sorry for my mistakes. If you have any query here, I will reply you. Thank you. PYTHON : imread returns None, violating error215Assertionfailedssizeemptyinfunctioncvresize cv2errorOpenCV4521error5BadargumentinfunctioncvtColor

Cv2 Error Error 215 Assertion Failed Src Empty In Function Cv Cvtcolor.pdf

Size: 3.30 MB · Format: PDF · Secure Download

Download PDF Read Online

Frequently Asked Questions

What is the most accurate information about Cv2 Error Error 215 Assertion Failed Src Empty In Function Cv Cvtcolor?

Our platform aggregates the most comprehensive and up-to-date insights, ensuring you get relevant details about Cv2 Error Error 215 Assertion Failed Src Empty In Function Cv Cvtcolor.

Why is Cv2 Error Error 215 Assertion Failed Src Empty In Function Cv Cvtcolor trending right now?

Interest in Cv2 Error Error 215 Assertion Failed Src Empty In Function Cv Cvtcolor has surged recently as more people seek reliable resources, related media, and detailed analysis.

Where can I find related media and updates for Cv2 Error Error 215 Assertion Failed Src Empty In Function Cv Cvtcolor?

You can explore extensive galleries, video summaries, and related content directly on this page.

How often is the content about Cv2 Error Error 215 Assertion Failed Src Empty In Function Cv Cvtcolor updated?

We regularly update our database with the latest information, media, and analysis related to Cv2 Error Error 215 Assertion Failed Src Empty In Function Cv Cvtcolor.

Related Documents

Popular Topics

Javascript Basic 64 Comparison With The Strict Inequality Operator Freecodecamp Git Worktrees Tutorial 1 What Are Git Worktrees 10minutetalk Ballistic Calculator Basics Shift Operators In Java Java Tutorials Coding For Beginners Code Bode Learn Python Functions By Building A To Do List App Delete Node Module Like A Pro Delete Node Module Within A Second Master Eclipse Trigger Points For Java Debugging Ho Stack Example 1 College Bound Overview Easy Filter Search W Javascript Quick Tutorial Running Testnav How To Enable Threads 2026 Full Guide Switch 2 Is Not Worth It Python Programming Tutorial 17 Optional Parameters Read Any Csv File With Javascript 1