Error 215 Assertion Failed Ssize Empty In Function Cv Resize Cv2 Error Information Guide

  1. Introduction to Error 215 Assertion Failed Ssize Empty In Function Cv Resize Cv2 Error
  2. Core Information
  3. Developments
  4. Detailed Analysis
  5. Conclusion

Introduction to Error 215 Assertion Failed Ssize Empty In Function Cv Resize Cv2 Error

error: (-215:Assertion failed) !ssize.empty() in function 'cv::resize' | cv2.error Update
Looking for the latest information on Error 215 Assertion Failed Ssize Empty In Function Cv Resize Cv2 Error? We've researched comprehensive data, records, and insights about Error 215 Assertion Failed Ssize Empty In Function Cv Resize Cv2 Error.

Core Information

Information (Solution)cv2.error: error: (-215:Assertion failed) !_src.empty() in function 'cv::cvtColor' Guide
Explore the main sources for Error 215 Assertion Failed Ssize Empty In Function Cv Resize Cv2 Error.

Developments

Full PYTHON : error: (-215) !empty() in function detectMultiScale Update
Stay updated on Error 215 Assertion Failed Ssize Empty In Function Cv Resize Cv2 Error's newest achievements.

error: (-215:Assertion failed) !_src.empty() in function 'cv::cvtColor' SOLVED in opencv
error: (-215:Assertion failed) !_src.empty() in function 'cv::cvtColor' SOLVED in opencv
PYTHON : error: (-215) !empty() in function detectMultiScale
PYTHON : error: (-215) !empty() in function detectMultiScale
cv2.error: error: (-215:Assertion failed) !_src.empty() in function 'cv::cvtColor'
cv2.error: error: (-215:Assertion failed) !_src.empty() in function 'cv::cvtColor'
error: (-215:Assertion failed) size.width>0 && size.height>0 in function 'cv::imshow' |cv2.error
error: (-215:Assertion failed) size.width>0 && size.height>0 in function 'cv::imshow' |cv2.error
OpenCV Python Tutorial  - cv.split, cv.merge, cv.resize, cv.add, cv.addWeighted, ROI
OpenCV Python Tutorial - cv.split, cv.merge, cv.resize, cv.add, cv.addWeighted, ROI
cv2.error: OpenCV(4.5.5) error: (-215:Assertion failed) !_img.empty() in function 'cv::imwrite'
cv2.error: OpenCV(4.5.5) error: (-215:Assertion failed) !_img.empty() in function 'cv::imwrite'
2. Rescaling image using Open CV and Python
2. Rescaling image using Open CV and Python
error:(-215:Assertion failed) size.width0 && size.height0 in function 'cv::imshow' SOLVED in opencv
error:(-215:Assertion failed) size.width0 && size.height0 in function 'cv::imshow' SOLVED in opencv
error: (-215:Assertion failed) !empty() in function 'cv::CascadeClassifier::detectMultiScale
error: (-215:Assertion failed) !empty() in function 'cv::CascadeClassifier::detectMultiScale
100% resolved imshow | (-215: Assertion Failed) size.width && size.height in function 'cv::imshow'
100% resolved imshow | (-215: Assertion Failed) size.width && size.height in function 'cv::imshow'
(SOLVED) Error Assertion failed ! src empty in Function  cv: cvtColor | Python error | cv2 Module
(SOLVED) Error Assertion failed ! src empty in Function cv: cvtColor | Python error | cv2 Module

Detailed Analysis

Data is compiled from public records and verified media reports.

Last Updated: September 26, 2026

Conclusion

Information PYTHON : OpenCV resize fails on large image with error: (-215) ssize.area()   0 in function cv::res Update
For 2026, Error 215 Assertion Failed Ssize Empty In Function Cv Resize Cv2 Error remains one of the most searched-for information profiles. Check back for the newest reports.

Disclaimer: Disclaimer: All information is compiled from publicly available data, media reports, and analysis. Actual details may vary.

Summary

error215Assertionfailedssizeemptyinfunctioncvresize I am fresher youtuber Sorry for my mistakes. If you have any query here, I will reply you. Thank you. In this video on OpenCV Python Tutorial For Beginners, I am going to show How to do some Basic and Arithmetic Operations on ... In this video tutorial we will learn how to

Error 215 Assertion Failed Ssize Empty In Function Cv Resize Cv2 Error.pdf

Size: 3.23 MB · Format: PDF · Secure Download

Download PDF Read Online

Frequently Asked Questions

What is the most accurate information about Error 215 Assertion Failed Ssize Empty In Function Cv Resize Cv2 Error?

Our platform aggregates the most comprehensive and up-to-date insights, ensuring you get relevant details about Error 215 Assertion Failed Ssize Empty In Function Cv Resize Cv2 Error.

Why is Error 215 Assertion Failed Ssize Empty In Function Cv Resize Cv2 Error trending right now?

Interest in Error 215 Assertion Failed Ssize Empty In Function Cv Resize Cv2 Error has surged recently as more people seek reliable resources, related media, and detailed analysis.

Where can I find related media and updates for Error 215 Assertion Failed Ssize Empty In Function Cv Resize Cv2 Error?

You can explore extensive galleries, video summaries, and related content directly on this page.

How often is the content about Error 215 Assertion Failed Ssize Empty In Function Cv Resize Cv2 Error updated?

We regularly update our database with the latest information, media, and analysis related to Error 215 Assertion Failed Ssize Empty In Function Cv Resize Cv2 Error.

Related Documents

Popular Topics

Don't Miss Out - POA Form Compliance Is Crucial Make The Most Of ASU's Break Weeks With A Strategic Plan The Story Behind Coi Leray's Name Learn Professional Calligraphy With Our Expert-Designed Bubble Letter Template Printable. Seattle's Daily NY Times Crossword Puzzle Solutions Online Can You Survive The Terrors Of Denver's 13th Floor Haunted House People Magazine Crossword Solutions For Busy Lives Made Easy Get Instant Access To Humble ISD's Official Calendar Updates Unlocking The Secret To Perfect CMCSS School Calendar Organization Streamline Your Real Estate Process With ZipForm Plus Login And Other Top Integrations Mastering Carrd Templates For Ecommerce A Game Changer Unlock Secrets To Winning Cases At Beltrami Court Unlock The Spiritual Energy Of Pittsburgh Venkateswara Temple In 2025 With This Tip Unlock Secret Military Communication Methods Using The Phonetic Alphabet Get Ahead Of The Game: Understanding Average Intelligence Quotient Scores