Error 215 Assertion Failed Empty In Function Cv Cascadeclassifier Detectmultiscale Information Guide

  1. Overview on Error 215 Assertion Failed Empty In Function Cv Cascadeclassifier Detectmultiscale
  2. Important Facts
  3. Recent Updates
  4. Expert Insights
  5. Future Outlook

Overview on Error 215 Assertion Failed Empty In Function Cv Cascadeclassifier Detectmultiscale

Information error: (-215:Assertion failed) !empty() in function 'cv::CascadeClassifier::detectMultiScale Guide
Looking for the latest information on Error 215 Assertion Failed Empty In Function Cv Cascadeclassifier Detectmultiscale? We've compiled comprehensive data, records, and insights about Error 215 Assertion Failed Empty In Function Cv Cascadeclassifier Detectmultiscale.

Important Facts

Information PYTHON : error: (-215) !empty() in function detectMultiScale News
Explore the main sources for Error 215 Assertion Failed Empty In Function Cv Cascadeclassifier Detectmultiscale.

Recent Updates

Details PYTHON : error: (-215) !empty() in function detectMultiScale Update
Stay updated on Error 215 Assertion Failed Empty In Function Cv Cascadeclassifier Detectmultiscale's newest achievements.

error: (-215:Assertion failed) !_src.empty() in function 'cv::cvtColor' SOLVED in opencv
error: (-215:Assertion failed) !_src.empty() in function 'cv::cvtColor' SOLVED in opencv
cv2.error: error: (-215:Assertion failed) !_src.empty() in function 'cv::cvtColor'
cv2.error: error: (-215:Assertion failed) !_src.empty() in function 'cv::cvtColor'
error: (-215:Assertion failed) !ssize.empty() in function 'cv::resize' | cv2.error
error: (-215:Assertion failed) !ssize.empty() in function 'cv::resize' | cv2.error
error: (-215:Assertion failed) src.type() == CV_8UC1 in function 'cv::adaptiveThreshold'
error: (-215:Assertion failed) src.type() == CV_8UC1 in function 'cv::adaptiveThreshold'
cv2.error: OpenCV(4.5.5) error: (-215:Assertion failed) !_img.empty() in function 'cv::imwrite'
cv2.error: OpenCV(4.5.5) error: (-215:Assertion failed) !_img.empty() in function 'cv::imwrite'
100% resolved imshow | (-215: Assertion Failed) size.width && size.height in function 'cv::imshow'
100% resolved imshow | (-215: Assertion Failed) size.width && size.height in function 'cv::imshow'
(SOLVED) Error Assertion failed ! src empty in Function  cv: cvtColor | Python error | cv2 Module
(SOLVED) Error Assertion failed ! src empty in Function cv: cvtColor | Python error | cv2 Module
C++ : OpenCV - undefined reference to 'cv::CascadeClassifier::detectMultiScale()' after NDK update
C++ : OpenCV - undefined reference to 'cv::CascadeClassifier::detectMultiScale()' after NDK update
error:(-215:Assertion failed) size.width0 && size.height0 in function 'cv::imshow' SOLVED in opencv
error:(-215:Assertion failed) size.width0 && size.height0 in function 'cv::imshow' SOLVED in opencv
error: (-215:Assertion failed) size.width>0 && size.height>0 in function 'cv::imshow' |cv2.error
error: (-215:Assertion failed) size.width>0 && size.height>0 in function 'cv::imshow' |cv2.error
PYTHON : OpenCV resize fails on large image with error: (-215) ssize.area()   0 in function cv::res
PYTHON : OpenCV resize fails on large image with error: (-215) ssize.area() 0 in function cv::res

Expert Insights

Data is compiled from public records and verified media reports.

Last Updated: September 27, 2026

Future Outlook

Details (Solution)cv2.error: error: (-215:Assertion failed) !_src.empty() in function 'cv::cvtColor' Guide
For 2026, Error 215 Assertion Failed Empty In Function Cv Cascadeclassifier Detectmultiscale remains one of the most searched-for information profiles. Check back for the latest updates.

Disclaimer: Disclaimer: All information is compiled from publicly available data, media reports, and analysis. Actual details may vary.

Summary

I am fresher youtuber Sorry for my mistakes. If you have any query here, I will reply you. Thank you. error215Assertionfailedssizeemptyinfunctioncvresize C++ : OpenCV - undefined reference to '

Error 215 Assertion Failed Empty In Function Cv Cascadeclassifier Detectmultiscale.pdf

Size: 4.20 MB · Format: PDF · Secure Download

Download PDF Read Online

Frequently Asked Questions

What is the most accurate information about Error 215 Assertion Failed Empty In Function Cv Cascadeclassifier Detectmultiscale?

Our platform aggregates the most comprehensive and up-to-date insights, ensuring you get relevant details about Error 215 Assertion Failed Empty In Function Cv Cascadeclassifier Detectmultiscale.

Why is Error 215 Assertion Failed Empty In Function Cv Cascadeclassifier Detectmultiscale trending right now?

Interest in Error 215 Assertion Failed Empty In Function Cv Cascadeclassifier Detectmultiscale has surged recently as more people seek reliable resources, related media, and detailed analysis.

Where can I find related media and updates for Error 215 Assertion Failed Empty In Function Cv Cascadeclassifier Detectmultiscale?

You can explore extensive galleries, video summaries, and related content directly on this page.

How often is the content about Error 215 Assertion Failed Empty In Function Cv Cascadeclassifier Detectmultiscale updated?

We regularly update our database with the latest information, media, and analysis related to Error 215 Assertion Failed Empty In Function Cv Cascadeclassifier Detectmultiscale.

Related Documents

Popular Topics

Cueto Punctuates A Complete Game Search Techniques On Lexis%e2%84%a2 Pov Healing Tutorials Convocation 2026 Midsegment Theorem Avoid Common Fines In Nj How To Renew Your Dmv Registration Efficiently Javascript Basics Repeat Crisis Intervention Training Video My Element Collection 61 Elements Explained Bash Profile Bashrc And Bash Logout Files What Is Credentialing Object Oriented Programming Code And Programming For Beginners 25 Of 28 Study Hall Quick Python Madlib Mad Lib Tutorial Teach Or Learn With Python Mat240 Module 5 Assignment Use Material Subject Word Promot Jars For Your Visual Journal Or Junk Journal Page