Error 215 Assertion Failed Src Empty In Function Cv Cvtcolor Solved In Opencv Information Guide

  1. Introduction on Error 215 Assertion Failed Src Empty In Function Cv Cvtcolor Solved In Opencv
  2. Main Features
  3. Recent Updates
  4. Deep Dive
  5. Final Thoughts

Introduction on Error 215 Assertion Failed Src Empty In Function Cv Cvtcolor Solved In Opencv

Full error: (-215:Assertion failed) !_src.empty() in function 'cv::cvtColor' SOLVED in opencv Guide
Looking for the latest information on Error 215 Assertion Failed Src Empty In Function Cv Cvtcolor Solved In Opencv? We've researched comprehensive data, records, and insights about Error 215 Assertion Failed Src Empty In Function Cv Cvtcolor Solved In Opencv.

Main Features

Details (Solution)cv2.error: error: (-215:Assertion failed) !_src.empty() in function 'cv::cvtColor' Update
Explore the main sources for Error 215 Assertion Failed Src Empty In Function Cv Cvtcolor Solved In Opencv.

Recent Updates

(SOLVED) Error Assertion failed ! src empty in Function  cv: cvtColor | Python error | cv2 Module Guide
Stay updated on Error 215 Assertion Failed Src Empty In Function Cv Cvtcolor Solved In Opencv's latest milestones.

cv2.error: OpenCV(4.5.5) error: (-215:Assertion failed) !_img.empty() in function 'cv::imwrite'
cv2.error: OpenCV(4.5.5) error: (-215:Assertion failed) !_img.empty() in function 'cv::imwrite'
PYTHON : error: (-215) !empty() in function detectMultiScale
PYTHON : error: (-215) !empty() in function detectMultiScale
error: (-215:Assertion failed) !ssize.empty() in function 'cv::resize' | cv2.error
error: (-215:Assertion failed) !ssize.empty() in function 'cv::resize' | cv2.error
error: (-215:Assertion failed) !empty() in function 'cv::CascadeClassifier::detectMultiScale
error: (-215:Assertion failed) !empty() in function 'cv::CascadeClassifier::detectMultiScale
PYTHON : imread returns None, violating assertion !_src.empty() in function 'cvtColor' error
PYTHON : imread returns None, violating assertion !_src.empty() in function 'cvtColor' error
PYTHON : imread returns None, violating assertion !_src.empty() in function 'cvtColor' error
PYTHON : imread returns None, violating assertion !_src.empty() in function 'cvtColor' error
Video Capture function produces cv::cvtcolor error | OpenCv error resolved
Video Capture function produces cv::cvtcolor error | OpenCv error resolved
PYTHON : open cv error: (-215) scn == 3 || scn == 4 in function cvtColor
PYTHON : open cv error: (-215) scn == 3 || scn == 4 in function cvtColor
error:(-215:Assertion failed) size.width0 && size.height0 in function 'cv::imshow' SOLVED in opencv
error:(-215:Assertion failed) size.width0 && size.height0 in function 'cv::imshow' SOLVED in opencv
cv2.error: OpenCV(4.5.2) :-1: error: (-5:Bad argument) in function 'cvtColor'
cv2.error: OpenCV(4.5.2) :-1: error: (-5:Bad argument) in function 'cvtColor'
error: (-215:Assertion failed) src.type() == CV_8UC1 in function 'cv::adaptiveThreshold'
error: (-215:Assertion failed) src.type() == CV_8UC1 in function 'cv::adaptiveThreshold'

Deep Dive

Data is compiled from public records and verified media reports.

Last Updated: September 30, 2026

Final Thoughts

Details cv2.error: error: (-215:Assertion failed) !_src.empty() in function 'cv::cvtColor' Guide
For 2026, Error 215 Assertion Failed Src Empty In Function Cv Cvtcolor Solved In Opencv remains one of the most talked-about information profiles. Check back for the newest reports.

Disclaimer: Disclaimer: All information is compiled from publicly available data, media reports, and analysis. Actual details may vary.

Summary

I am fresher youtuber Sorry for my mistakes. If you have any query here, I will reply you. Thank you. error215Assertionfailedssizeemptyinfunctioncvresize # PYTHON : imread returns None, violating cv2errorOpenCV4521error5BadargumentinfunctioncvtColor #

Error 215 Assertion Failed Src Empty In Function Cv Cvtcolor Solved In Opencv.pdf

Size: 3.62 MB · Format: PDF · Secure Download

Download PDF Read Online

Frequently Asked Questions

What is the most accurate information about Error 215 Assertion Failed Src Empty In Function Cv Cvtcolor Solved In Opencv?

Our platform aggregates the most comprehensive and up-to-date insights, ensuring you get relevant details about Error 215 Assertion Failed Src Empty In Function Cv Cvtcolor Solved In Opencv.

Why is Error 215 Assertion Failed Src Empty In Function Cv Cvtcolor Solved In Opencv trending right now?

Interest in Error 215 Assertion Failed Src Empty In Function Cv Cvtcolor Solved In Opencv has surged recently as more people seek reliable resources, related media, and detailed analysis.

Where can I find related media and updates for Error 215 Assertion Failed Src Empty In Function Cv Cvtcolor Solved In Opencv?

You can explore extensive galleries, video summaries, and related content directly on this page.

How often is the content about Error 215 Assertion Failed Src Empty In Function Cv Cvtcolor Solved In Opencv updated?

We regularly update our database with the latest information, media, and analysis related to Error 215 Assertion Failed Src Empty In Function Cv Cvtcolor Solved In Opencv.

Related Documents

Popular Topics

Geolayers 3 Tutorial Getting Started 20110726 Ramirezs Two Run Blast Css Multi Column Layout Css Tutorial For Beginners Directed Graphs In Python Solubility Table F Css Notification Badge Animation Css Animation Tutorial For Beginners Programmingtube4dev Python Numpy Multidimensional Array Deconstructing The Hurt Feelings Report For Personal Growth Studyminder Tutorial 2 Entering An Assignment Easy Texas Classic New Onlyfans Creative Content Ideas Python Tkinter Tic Tac Toe Game Tutorial For Beginners With Tkinter Part 3 3 The Flag Makers Llc Custom Made Flags Calendar Visualized Instructions Lets Learn Python Programming Basics Part 1 Introduction To Python