Solution Cv2 Error Error 215 Assertion Failed Src Empty In Function Cv Cvtcolor Information Guide

  1. About of Solution Cv2 Error Error 215 Assertion Failed Src Empty In Function Cv Cvtcolor
  2. Key Details
  3. Recent Updates
  4. Full Guide
  5. Summary

About of Solution Cv2 Error Error 215 Assertion Failed Src Empty In Function Cv Cvtcolor

Full (Solution)cv2.error: error: (-215:Assertion failed) !_src.empty() in function 'cv::cvtColor' Update
Looking for the latest information on Solution Cv2 Error Error 215 Assertion Failed Src Empty In Function Cv Cvtcolor? We've gathered comprehensive data, records, and insights about Solution Cv2 Error Error 215 Assertion Failed Src Empty In Function Cv Cvtcolor.

Key Details

Details error: (-215:Assertion failed) !_src.empty() in function 'cv::cvtColor' SOLVED in opencv Guide
Explore the main sources for Solution Cv2 Error Error 215 Assertion Failed Src Empty In Function Cv Cvtcolor.

Recent Updates

Information cv2.error: error: (-215:Assertion failed) !_src.empty() in function 'cv::cvtColor' Update
Stay updated on Solution Cv2 Error Error 215 Assertion Failed Src Empty In Function Cv Cvtcolor's latest milestones.

Video Capture function produces cv::cvtcolor error | OpenCv error resolved
Video Capture function produces cv::cvtcolor error | OpenCv error resolved
cv2.error: OpenCV(4.5.5) error: (-215:Assertion failed) !_img.empty() in function 'cv::imwrite'
cv2.error: OpenCV(4.5.5) error: (-215:Assertion failed) !_img.empty() in function 'cv::imwrite'
error: (-215:Assertion failed) src.type() == CV_8UC1 in function 'cv::adaptiveThreshold'
error: (-215:Assertion failed) src.type() == CV_8UC1 in function 'cv::adaptiveThreshold'
error: (-215:Assertion failed) !empty() in function 'cv::CascadeClassifier::detectMultiScale
error: (-215:Assertion failed) !empty() in function 'cv::CascadeClassifier::detectMultiScale
error: (-215:Assertion failed) !ssize.empty() in function 'cv::resize' | cv2.error
error: (-215:Assertion failed) !ssize.empty() in function 'cv::resize' | cv2.error
PYTHON : imread returns None, violating assertion !_src.empty() in function 'cvtColor' error
PYTHON : imread returns None, violating assertion !_src.empty() in function 'cvtColor' error
PYTHON : imread returns None, violating assertion !_src.empty() in function 'cvtColor' error
PYTHON : imread returns None, violating assertion !_src.empty() in function 'cvtColor' error
PYTHON : error: (-215) !empty() in function detectMultiScale
PYTHON : error: (-215) !empty() in function detectMultiScale
error:(-215:Assertion failed) size.width0 && size.height0 in function 'cv::imshow' SOLVED in opencv
error:(-215:Assertion failed) size.width0 && size.height0 in function 'cv::imshow' SOLVED in opencv
PYTHON : error: (-215) !empty() in function detectMultiScale
PYTHON : error: (-215) !empty() in function detectMultiScale
cv2.error: OpenCV(4.5.2) :-1: error: (-5:Bad argument) in function 'cvtColor'
cv2.error: OpenCV(4.5.2) :-1: error: (-5:Bad argument) in function 'cvtColor'

Full Guide

Data is compiled from public records and verified media reports.

Last Updated: September 28, 2026

Summary

Full (SOLVED) Error Assertion failed ! src empty in Function  cv: cvtColor | Python error | cv2 Module Guide
For 2026, Solution Cv2 Error Error 215 Assertion Failed Src Empty In Function Cv Cvtcolor remains one of the most searched-for information profiles. Check back for the newest reports.

Disclaimer: Disclaimer: All information is compiled from publicly available data, media reports, and analysis. Actual details may vary.

Summary

I am fresher youtuber Sorry for my mistakes. If you have any query here, I will reply you. Thank you. error215Assertionfailedssizeemptyinfunctioncvresize PYTHON : imread returns None, violating cv2errorOpenCV4521error5BadargumentinfunctioncvtColor

Solution Cv2 Error Error 215 Assertion Failed Src Empty In Function Cv Cvtcolor.pdf

Size: 3.76 MB · Format: PDF · Secure Download

Download PDF Read Online

Frequently Asked Questions

What is the most accurate information about Solution Cv2 Error Error 215 Assertion Failed Src Empty In Function Cv Cvtcolor?

Our platform aggregates the most comprehensive and up-to-date insights, ensuring you get relevant details about Solution Cv2 Error Error 215 Assertion Failed Src Empty In Function Cv Cvtcolor.

Why is Solution Cv2 Error Error 215 Assertion Failed Src Empty In Function Cv Cvtcolor trending right now?

Interest in Solution Cv2 Error Error 215 Assertion Failed Src Empty In Function Cv Cvtcolor has surged recently as more people seek reliable resources, related media, and detailed analysis.

Where can I find related media and updates for Solution Cv2 Error Error 215 Assertion Failed Src Empty In Function Cv Cvtcolor?

You can explore extensive galleries, video summaries, and related content directly on this page.

How often is the content about Solution Cv2 Error Error 215 Assertion Failed Src Empty In Function Cv Cvtcolor updated?

We regularly update our database with the latest information, media, and analysis related to Solution Cv2 Error Error 215 Assertion Failed Src Empty In Function Cv Cvtcolor.

Related Documents

Popular Topics

Mastering CVC Pictures And Words For Early Reading Success Plan Ahead With KSU's Fall 2025 Academic Calendar And Important Dates Mastering NFL Pick Em Sheets Requires These Proven Tactics Is Your Brookhaven Neighborhood Ready For Bulk Garbage Pickup? How To Read A Ballistics Chart For Improved Accuracy Unlock The Vibrant World Of Colorful In Spanish Language Spice Up Halloween With Jason Voorhees Stencils Crush Your M1 Tax Filing In Minnesota: Expert Tricks For Success Reviving The Art Of Writing With Your Tongue And A Feathered Quill Prosper ISD Calendar 25 26 PDF Download Made Easy Unlocking The Secrets To Successful Natal Chart Compatibility Get Instant Results With Our Ready-Made Website Body Template Solutions Is Investing In 10-Year Treasuries Really A Safe Haven Simplify Your School Year With Manatee County's Educational Calendar Say Goodbye To Lost Messages With Proven Storage Solutions